{"text_format":"1","workbook":"xlsx","n_sheets":4,"sheets":["Prognose","res inkl prosjekter","res eksl prosjekter","Rapport"],"not_rendered":{"charts":0,"images":2,"macros":1,"external_links":0,"defined_names":8,"comments":0,"pivot_tables":0},"unopened":[],"bounds":{"document_bytes":16777216,"sheet_cells":100000,"rows_first":2000,"rows_last":500,"rows_between":2000,"halvings":0,"cell_chars":16384,"cell_head_chars":4096},"cells_cut":0,"cells_raw":0,"read":"whole","date_system":"1900"}

{"sheet":"Prognose","index":0,"n_rows":277,"n_cols":3,"rows_kept":277,"cut":false,"hidden":true,"merged":[]}
["Koststed","Skole/avd","Prognose"]
[12100,"Ammerud skole",-1607300]
[12101,"Bakås skole",-79000]
[12102,"Bekkelaget skole",382923]
[12103,"Bestum skole",0]
[12104,"Bjørndal skole",-54689]
[12105,"Bolteløkka skole",-124000]
[12106,"Bryn skole",-28000]
[12107,"Bygdøy skole",0]
[12108,"Disen skole",0]
[12109,"Ekeberg skole",0]
[12110,"Ellingsrudåsen skole",-112000]
[12111,"Furuset skole",2000]
[12112,"Gamlebyen skole",155000]
[12113,"Godlia skole",390660]
[12114,"Grefsen skole",753666]
[12115,"Grindbakken skole",0]
[12116,"Grorud skole",-451000]
[12117,"Grunerløkka skole",1091000]
[12118,"Hallagerbakken skole",-125]
[12119,"Hasle skole",-1830000]
[12121,"Høybråten skole",-25485]
[12122,"Jeriko skole",0]
[12123,"Kampen skole",0]
[12124,"Kjelsås skole",90000]
[12125,"Klemetsrud skole",0]
[12126,"Korsvoll skole",606000]
[12127,"Kringsjå skole",-350000]
[12128,"Lakkegata skole",1086000]
[12129,"Lilleaker skole",-399000]
[12130,"Lilleborg skole",-228593]
[12131,"Ljan skole",-343482]
[12132,"Lusetjern skole",19000]
[12133,"Lutvann skole",-845000]
[12134,"Lysejordet skole",-78100]
[12136,"Manglerud skole",32452000]
[12138,"Mortensrud skole",-500000]
[12139,"Munkerud skole",-987000]
[12140,"Møllergata skole",729000]
[12141,"Nedre Bekkelaget skole",-121000]
[12142,"Nordstrand skole",-542000]
[12143,"Nordtvet skole",-95160]
[12144,"Nøklevann skole",382026]
[12145,"Prinsdal skole",268000]
[12146,"Rosenholm skole",9000]
[12147,"Rustad skole",0]
[12148,"Rødtvet skole",-5655940]
[12149,"Sagene skole",122000]
[12150,"Seterbråten skole",134000]
[12151,"Skjønnhaug skole",-51000]
[12152,"Skøyen skole",0]
[12153,"Slemdal skole",-1497272]
[12154,"Smestad skole",-999481]
[12155,"Stenbråten skole",0]
[12157,"Stovner skole",-227000]
[12158,"Svarttjern skole",-467000]
[12160,"Sørkedalen skole",-70580]
[12162,"Tonsenhagen skole",-261000]
[12163,"Toppåsen skole",127839]
[12164,"Trasop skole",0]
[12165,"Trosterud skole",31000]
[12166,"Tveita skole",124000]
[12167,"Tøyen skole",-1231000]
[12167,"Tøyen skole",-1231000]
[12168,"Tåsen skole",-488000]
[12169,"Ullevål skole",-507000]
[12170,"Vahl skole",77677]
[12171,"Vestli skole",183000]
[12172,"Vinderen skole",0]
[12173,"Voksen skole",0]
[12174,"Vålerenga skole",187000]
[12175,"Østensjø skole",-196834]
[12176,"Bogstad skole",3000]
[12177,"Løren skole",-360274]
[12178,"Berg skole",399000]
[12179,"Fernanda Nissen skole",1840529]
[12200,"Abildsø skole",0]
[12201,"Bjølsen skole",-102330]
[12203,"Bøler skole",473000]
[12204,"Gran skole",0]
[12206,"Høyenhall skole",0]
[12207,"Ila skole",52345]
[12208,"Karlsrud skole",115815]
[12209,"Lambertseter skole",0]
[12210,"Lindeberg skole",-381000]
[12211,"Linderud skole",-1163778]
[12212,"Majorstuen skole",1156242]
[12213,"Marienlyst skole",-1926000]
[12214,"Oppsal skole",-478000]
[12215,"Rommen skole",5769]
[12216,"Ruseløkka skole",-728127]
[12217,"Sinsen skole",400000]
[12218,"Uranienborg skole",12624992]
[12220,"Årvoll skole",0]
[12221,"Markaskolen",0]
[12224,"Oslo sjøskole (Hovedøya)",49000]
[12226,"Kastellet skole",{"$error":"#VALUE!"}]
[12227,"Nordpolen skole",269000]
[12228,"Teglverket skole",1089900]
[12300,"Apalløkka skole",454910]
[12301,"Bjørnholt skole",-1024709]
[12302,"Bjørnsletta skole",-1000457]
[12303,"Brannfjell skole",-427000]
[12304,"Ellingsrud skole",552000]
[12305,"Engebråten skole",227758]
[12306,"Groruddalen skole",209000]
[12307,"Haugenstua skole",-516003]
[12308,"Haugerud skole",-140000]
[12309,"Hauketo skole",1000000]
[12311,"Holmlia skole",0]
[12314,"Jordal skole",1108000]
[12315,"Lofsrud skole",225000]
[12317,"Nordberg skole",-2393]
[12318,"Nordseter skole",1558000]
[12319,"Ris ungdomsskole",-100724]
[12320,"Skullerud skole",1295000]
[12321,"Skøyenåsen skole",0]
[12322,"Stasjonsfjellet skole",-32530]
[12323,"Tokerud skole",-219340]
[12324,"Øraker skole",482400]
[12326,"Frydenberg skole",807000]
[12327,"Morellbakken skole",-20000]
[12328,"Sofienberg skole",2336500]
[12329,"Fagerborg skole",71128]
[12330,"Granstangen skole",20000]
[12403,"Blindern videregående skole",127583]
[12408,"Foss videregående skole",-2727000]
[12412,"Hartvig Nissens skole",1749]
[12413,"Hellerud videregående skole",239000]
[12414,"Holtet videregående skole",1053000]
[12415,"Lambertseter videregående skole",2495000]
[12416,"Bjerke videregående skole",368000]
[12418,"Kongshavn videregående skole",211000]
[12419,"Oslo handelsgymnasium",-1235000]
[12420,"Oslo katedralskole",-333000]
[12421,"Nydalen videregående skole",576000]
[12422,"Edvard Munch videregående skole",5719000]
[12423,"Etterstad videregående skole",-80993]
[12424,"Persbråten videregående skole",-357993]
[12428,"Hersleb videregående skole",-1343669]
[12430,"Stovner videregående skole",1872000]
[12432,"Ullern videregående skole",4493000]
[12433,"Ulsrud videregående skole",-710370]
[12436,"Elvebakken vg. skole adm.",899000]
[12448,"Bjørnholt videregående skole",244000]
[12450,"Kuben vgs -  Budsjettjusteringer",-495500]
[12711,"PPT Administrasjon",0]
[12719,"Læringsmiljøteamet",0]
[12723,"PPT Team A",0]
[12724,"PPT Team B",0]
[12726,"PPT Team C",193000]
[12727,"PPT Team D",0]
[12728,"PPT Team E",0]
[12729,"PPT Team F",200000]
[12881,"Grønland voksenopplæringssenter",258000]
[12882,"Oslo VO Skullerud - Tiltak ROM",1699927.4285714282]
[12883,"Oslo VO Skullerud",815244.07142857194]
[12884,"Oslo VO Helsfyr",305000]
[12886,"Oslo VO Nydalen",20412]
[12887,"Oslo VO Sinsen",0]
[12888,"Hersleb VG, grunnskoleopplæring",-52000]
[12889,"Holtet vg., grunnskoleopplæring",261000]
[12891,"Oslo VO Rosenhof",6094721]
[12893,"Bjerke vgs - grunnskoleopplæring",0]
[12896,"Oslo VO Skullerud - Grunnskole",-1267017.1428571432]
[12897,"Oslo VO Skullerud - avdeling NO/SKU",-988005.38095238153]
[12898,"Kuben vgs - Norskopplæring for voksne",0]
[52360,"Aktivitetsskolen Abildsø",68000]
[52361,"Aktivitetsskolen Ammerud",978286]
[52362,"Aktivitetsskolen Bakås",-173000]
[52363,"Aktivitetsskolen Bekkelaget",24336]
[52365,"Aktivitetsskolen Bjølsen",0]
[52366,"Aktivitetsskolen Bjørndal",-257856]
[52367,"Aktivitetsskolen Bogstad",0]
[52369,"Aktivitetsskolen Bryn",-112000]
[52370,"Aktivitetsskolen Bygdøy",0]
[52371,"Aktivitetsskolen Bøler",0]
[52372,"Aktivitetsskolen Disen",-625]
[52373,"Aktivitetsskolen Ekeberg",0]
[52374,"Aktivitetsskolen Ellingsrudåsen",0]
[52375,"Aktivitetsskolen Furuset",-440000]
[52376,"Aktivitetsskolen Gamlebyen",-106000]
[52377,"Aktivitetsskolen Godlia",54000]
[52378,"Aktivitetsskolen Gran",0]
[52379,"Aktivitetsskolen Grefsen",353000]
[52380,"Aktivitetsskolen Grindbakken",0]
[52382,"Aktivitetsskolen Grünerløkka",0]
[52383,"Aktivitetsskolen Hallagerbakken",58432]
[52384,"Aktivitetsskolen Hasle",0]
[52385,"Aktivitetsskolen Haugen",-177000]
[52387,"Aktivitetsskolen Høybråten",-40747]
[52388,"Aktivitetsskolen Høyenhall",0]
[52389,"Aktivitetsskolen Ila",180000]
[52390,"Aktivitetsskolen Jeriko",0]
[52391,"Aktivitetsskolen Kampen",0]
[52392,"Aktivitetsskolen Karlsrud",120000]
[52393,"Aktivitetsskolen Kjelsås",-13000]
[52394,"Aktivitetsskolen Klemetsrud",210000]
[52396,"Aktivitetsskolen Kringsjå",3000]
[52398,"Aktivitetsskolen Lambertseter",0]
{"$rows_left_out":78}
{"sheet":"res inkl prosjekter","index":1,"n_rows":447,"n_cols":3,"rows_kept":447,"cut":false,"hidden":true,"merged":[]}
["Koststed","Koststed(T)","Resultatet 2016"]
[12000,"Direktør",881]
[12001,"Områdedirektør C",-282]
[12002,"Områdedirektør A",-49]
[12004,"Områdedirektør F",-325]
[12005,"Områdedirektør G",-41]
[12006,"Områdedirektør E",-105]
[12007,"Områdedirektør D",-331]
[12012,"Områdedirektør B",54]
[12013,"Ass. direktør",484]
[12015,"Avd. for dokumentasjon og informasjon",1303]
[12017,"Infoteam",592]
[12018,"Skolemuseum",158]
[12019,"ADP - AFP og Uføre",288]
[12020,"Avd. for økonomi",-543]
[12022,"ØKO, teknisk",8064]
[12023,"Avd. for personal og administrasjon",90]
[12024,"ADP - fellesutgifter (200)",-2165]
[12025,"Trimrommet/Trivselgruppa",-70]
[12026,"Internadministrasjon",1301]
[12027,"ASA erstatningslokaler og pukkelkostnader",6773]
[12030,"ASA investeringer, inventar og utstyr",-181]
[12031,"Avd. for ped. utvikling og kvalitet",-547]
[12033,"Avdeling for PPT og spesialskoler",587]
[12035,"Avd. for IKT",395]
[12036,"IKT, prosjekter",-6]
[12037,"IKT drift (200)",42]
[12038,"Omstillingstiltak (UDA)",131]
[12040,"EFT Kompetansesenter",0]
[12041,"Avdeling for fagopplæring",-811]
[12042,"ASA prosjekteringsmidler",-9102]
[12043,"Avd. for elevforvaltning og planlegging",7]
[12045,"EFT Kompetanse",-1896]
[12046,"EFT - Kundesenter HR",860]
[12047,"Seksjon for Lønn- og personaltjenester",-263]
[12048,"Seksjon for Regnskap- og økonomitjenester",1299]
[12049,"Avd. for skoleanlegg",-1454]
[12055,"PED - IKT",396]
[12056,"PED - Videreutdanning",13128]
[12057,"PED - Lærernes læring",165]
[12058,"PED - Leksehjelp",97]
[12059,"PED - Internasjonalisering og fremmedspråk",522]
[12060,"PED - Elevvurdering",57]
[12061,"PED - DOK",1263]
[12062,"PED - Særskilt satsing",2313]
[12063,"Teach First",2003]
[12064,"PED - Norsk",1584]
[12065,"Sommerskolen",-379]
[12067,"Groruddalssatsningen / Oslo sør",5067]
[12068,"ASA Husleier UBF 210",-3019]
[12070,"InnsIKT forvaltning",11853]
[12072,"PED - Aktivitetsskole/helhetlig skoledag",7018]
[12073,"PED - Realfag",412]
[12074,"Den kulturelle skolesekken",15443]
[12076,"Sentrale tillitsvalgte (G)",-229]
[12077,"Spesialgrupper",-126]
[12078,"Kommunikasjonsfaglige tjenester",197]
[12079,"ADP - Juridisk bistand (210)",-25]
[12080,"ØKO teknisk sted (210)",5934]
[12081,"EFP diverse",4253]
[12082,"ØKO - tilskudd opplæring av asylsøkere",1816]
[12083,"Høstjustering (210)",0]
[12084,"ASA inventar og utstyr (210)",-8025]
[12085,"Skyss (210)",7]
[12086,"ØKO - Integreringstilskudd",1605]
[12087,"Lederopplæring (GS)",2751]
[12088,"Årlige justeringer (210)",21797]
[12089,"Spesialundervisning Friskoler",-1371]
[12090,"Språklige minoriteter (210)",9423]
[12091,"IKT drift (210)",-659]
[12092,"ADP - fellesutgifter (210)",498]
[12093,"ASA, leieavtaler (210)",-1298]
[12094,"Omstillingstiltak (GS)",296]
[12095,"Gjesteelever",3397]
[12096,"PED - Etterutdanning",6257]
[12098,"HMS m.m.",-505]
[12099,"Språklige minoriteter - friskoler",733]
[12100,"Ammerud skole",-3264]
[12101,"Bakås skole",-289]
[12102,"Bekkelaget skole",1296]
[12103,"Bestum skole",1380]
[12104,"Bjørndal skole",641]
[12105,"Bolteløkka skole",861]
[12106,"Bryn skole",209]
[12107,"Bygdøy skole",261]
[12108,"Disen skole",892]
[12109,"Ekeberg skole",732]
[12110,"Ellingsrudåsen skole",495]
[12111,"Furuset skole",695]
[12112,"Gamlebyen skole",719]
[12113,"Godlia skole",974]
[12114,"Grefsen skole",1025]
[12115,"Grindbakken skole",573]
[12116,"Grorud skole",-795]
[12117,"Grunerløkka skole",3804]
[12118,"Hallagerbakken skole",107]
[12119,"Hasle skole",-1604]
[12120,"Huseby skole",-714]
[12121,"Høybråten skole",559]
[12122,"Jeriko skole",409]
[12123,"Kampen skole",515]
[12124,"Kjelsås skole",1903]
[12125,"Klemetsrud skole",586]
[12126,"Korsvoll skole",1274]
[12127,"Kringsjå skole",-243]
[12128,"Lakkegata skole",1712]
[12129,"Lilleaker skole",-282]
[12130,"Lilleborg skole",154]
[12131,"Ljan skole",645]
[12132,"Lusetjern skole",1550]
[12133,"Lutvann skole",-384]
[12134,"Lysejordet skole",506]
[12135,"Refstad skole",330]
[12136,"Manglerud skole",3247]
[12137,"Maridalen skole",739]
[12138,"Mortensrud skole",127]
[12139,"Munkerud skole",381]
[12140,"Møllergata skole",1617]
[12141,"Nedre Bekkelaget skole",355]
[12142,"Nordstrand skole",-333]
[12143,"Nordtvet skole",-881]
[12144,"Nøklevann skole",910]
[12145,"Prinsdal skole",953]
[12146,"Rosenholm skole",1708]
[12147,"Rustad skole",1704]
[12148,"Rødtvet skole",-4615]
[12149,"Sagene skole",-411]
[12150,"Seterbråten skole",989]
[12151,"Skjønnhaug skole",573]
[12152,"Skøyen skole",1235]
[12153,"Slemdal skole",-2982]
[12154,"Smestad skole",-610]
[12155,"Stenbråten skole",977]
[12156,"Stig skole",123]
[12157,"Stovner skole",789]
[12158,"Svarttjern skole",-409]
[12159,"Svendstuen skole",-507]
[12160,"Sørkedalen skole",414]
[12161,"Tiurleiken skole",-2218]
[12162,"Tonsenhagen skole",415]
[12163,"Toppåsen skole",-397]
[12164,"Trasop skole",3124]
[12165,"Trosterud skole",68]
[12166,"Tveita skole",-19]
[12167,"Tøyen skole",-1858]
[12168,"Tåsen skole",1136]
[12169,"Ullevål skole",176]
[12170,"Vahl skole",45]
[12171,"Vestli skole",576]
[12172,"Vinderen skole",776]
[12173,"Voksen skole",585]
[12174,"Vålerenga skole",813]
[12175,"Østensjø skole",-508]
[12176,"Bogstad skole",846]
[12177,"Løren skole",-823]
[12178,"Berg skole",886]
[12179,"Fernanda Nissen skole",1580]
[12180,"Brynseng skole",-107]
[12200,"Abildsø skole",814]
[12201,"Bjølsen skole",613]
[12202,"Bjøråsen skole",1147]
[12203,"Bøler skole",779]
[12204,"Gran skole",-1041]
[12205,"Haugen skole",-3841]
[12206,"Høyenhall skole",1796]
[12207,"Ila skole",520]
[12208,"Karlsrud skole",1052]
[12209,"Lambertseter skole",-3]
[12210,"Lindeberg skole",93]
[12211,"Linderud skole",-3612]
[12212,"Majorstuen skole",-1568]
[12213,"Marienlyst skole",-1450]
[12214,"Oppsal skole",-1679]
[12215,"Rommen skole",-320]
[12216,"Ruseløkka skole",-356]
[12217,"Sinsen skole",714]
[12218,"Uranienborg skole",460]
[12219,"Veitvet skole",-5684]
[12220,"Årvoll skole",114]
[12221,"Markaskolen",-294]
[12222,"Nordisk skoleidrett",62]
[12223,"Språksenteret",1306]
[12224,"Oslo sjøskole (Hovedøya)",199]
[12225,"Skolehagene",219]
[12226,"Kastellet skole",-485]
[12227,"Nordpolen skole",-309]
[12228,"Teglverket skole",3077]
[12300,"Apalløkka skole",506]
[12301,"Bjørnholt skole",250]
[12302,"Bjørnsletta skole",1710]
[12303,"Brannfjell skole",-319]
[12304,"Ellingsrud skole",809]
[12305,"Engebråten skole",2318]
[12306,"Groruddalen skole",1508]
[12307,"Haugenstua skole",505]
[12308,"Haugerud skole",667]
[12309,"Hauketo skole",1788]
[12311,"Holmlia skole",754]
[12313,"Hovseter skole",100]
[12314,"Jordal skole",2101]
{"$rows_left_out":248}
{"sheet":"res eksl prosjekter","index":2,"n_rows":478,"n_cols":3,"rows_kept":478,"cut":false,"hidden":true,"merged":[]}
["Koststed","Koststed(T)","Resultat 2016"]
[12000,"Direktør",881]
[12001,"Områdedirektør C",-282]
[12002,"Områdedirektør A",-49]
[12004,"Områdedirektør F",-325]
[12005,"Områdedirektør G",-41]
[12006,"Områdedirektør E",-105]
[12007,"Områdedirektør D",-331]
[12012,"Områdedirektør B",54]
[12013,"Ass. direktør",484]
[12015,"Avd. for dokumentasjon og informasjon",1303]
[12017,"Infoteam",592]
[12018,"Skolemuseum",158]
[12019,"ADP - AFP og Uføre",288]
[12020,"Avd. for økonomi",-543]
[12022,"ØKO, teknisk",8064]
[12023,"Avd. for personal og administrasjon",90]
[12024,"ADP - fellesutgifter (200)",-2151]
[12025,"Trimrommet/Trivselgruppa",-70]
[12026,"Internadministrasjon",1301]
[12027,"ASA erstatningslokaler og pukkelkostnader",6773]
[12030,"ASA investeringer, inventar og utstyr",-181]
[12031,"Avd. for ped. utvikling og kvalitet",-547]
[12033,"Avdeling for PPT og spesialskoler",587]
[12035,"Avd. for IKT",395]
[12036,"IKT, prosjekter",-6]
[12037,"IKT drift (200)",42]
[12038,"Omstillingstiltak (UDA)",131]
[12040,"EFT Kompetansesenter",0]
[12041,"Avdeling for fagopplæring",-811]
[12042,"ASA prosjekteringsmidler",-9102]
[12043,"Avd. for elevforvaltning og planlegging",7]
[12045,"EFT Kompetanse",-1896]
[12046,"EFT - Kundesenter HR",860]
[12047,"Seksjon for Lønn- og personaltjenester",-263]
[12048,"Seksjon for Regnskap- og økonomitjenester",1299]
[12049,"Avd. for skoleanlegg",-1454]
[12055,"PED - IKT",392]
[12056,"PED - Videreutdanning",768]
[12057,"PED - Lærernes læring",166]
[12058,"PED - Leksehjelp",97]
[12059,"PED - Internasjonalisering og fremmedspråk",522]
[12060,"PED - Elevvurdering",57]
[12061,"PED - DOK",1263]
[12062,"PED - Særskilt satsing",2313]
[12063,"Teach First",2003]
[12064,"PED - Norsk",1598]
[12065,"Sommerskolen",-379]
[12067,"Groruddalssatsningen / Oslo sør",2889]
[12068,"ASA Husleier UBF 210",-3019]
[12070,"InnsIKT forvaltning",11853]
[12072,"PED - Aktivitetsskole/helhetlig skoledag",16]
[12073,"PED - Realfag",412]
[12074,"Den kulturelle skolesekken",117]
[12076,"Sentrale tillitsvalgte (G)",-229]
[12077,"Spesialgrupper",-126]
[12078,"Kommunikasjonsfaglige tjenester",197]
[12079,"ADP - Juridisk bistand (210)",-25]
[12080,"ØKO teknisk sted (210)",5934]
[12081,"EFP diverse",3903]
[12082,"ØKO - tilskudd opplæring av asylsøkere",1243]
[12083,"Høstjustering (210)",0]
[12084,"ASA inventar og utstyr (210)",-8025]
[12085,"Skyss (210)",7]
[12086,"ØKO - Integreringstilskudd",1605]
[12087,"Lederopplæring (GS)",2751]
[12088,"Årlige justeringer (210)",21797]
[12089,"Spesialundervisning Friskoler",-1371]
[12090,"Språklige minoriteter (210)",9423]
[12091,"IKT drift (210)",-659]
[12092,"ADP - fellesutgifter (210)",-362]
[12093,"ASA, leieavtaler (210)",-1298]
[12094,"Omstillingstiltak (GS)",296]
[12095,"Gjesteelever",3397]
[12096,"PED - Etterutdanning",375]
[12098,"HMS m.m.",-505]
[12099,"Språklige minoriteter - friskoler",733]
[12100,"Ammerud skole",-3251]
[12101,"Bakås skole",-390]
[12102,"Bekkelaget skole",1296]
[12103,"Bestum skole",1280]
[12104,"Bjørndal skole",671]
[12105,"Bolteløkka skole",856]
[12106,"Bryn skole",73]
[12107,"Bygdøy skole",261]
[12108,"Disen skole",892]
[12109,"Ekeberg skole",732]
[12110,"Ellingsrudåsen skole",403]
[12111,"Furuset skole",713]
[12112,"Gamlebyen skole",734]
[12113,"Godlia skole",975]
[12114,"Grefsen skole",1025]
[12115,"Grindbakken skole",573]
[12116,"Grorud skole",-795]
[12117,"Grunerløkka skole",3804]
[12118,"Hallagerbakken skole",151]
[12119,"Hasle skole",-1607]
[12120,"Huseby skole",-786]
[12121,"Høybråten skole",507]
[12122,"Jeriko skole",420]
[12123,"Kampen skole",592]
[12124,"Kjelsås skole",1628]
[12125,"Klemetsrud skole",662]
[12126,"Korsvoll skole",1274]
[12127,"Kringsjå skole",-243]
[12128,"Lakkegata skole",1720]
[12129,"Lilleaker skole",-282]
[12130,"Lilleborg skole",106]
[12131,"Ljan skole",645]
[12132,"Lusetjern skole",1165]
[12133,"Lutvann skole",-384]
[12134,"Lysejordet skole",506]
[12135,"Refstad skole",330]
[12136,"Manglerud skole",3247]
[12137,"Maridalen skole",739]
[12138,"Mortensrud skole",-28]
[12139,"Munkerud skole",233]
[12140,"Møllergata skole",1611]
[12141,"Nedre Bekkelaget skole",355]
[12142,"Nordstrand skole",-481]
[12143,"Nordtvet skole",-881]
[12144,"Nøklevann skole",776]
[12145,"Prinsdal skole",953]
[12146,"Rosenholm skole",1596]
[12147,"Rustad skole",1934]
[12148,"Rødtvet skole",-4768]
[12149,"Sagene skole",-403]
[12150,"Seterbråten skole",989]
[12151,"Skjønnhaug skole",676]
[12152,"Skøyen skole",1080]
[12153,"Slemdal skole",-3142]
[12154,"Smestad skole",-609]
[12155,"Stenbråten skole",967]
[12156,"Stig skole",122]
[12157,"Stovner skole",792]
[12158,"Svarttjern skole",-340]
[12159,"Svendstuen skole",-507]
[12160,"Sørkedalen skole",414]
[12161,"Tiurleiken skole",-2350]
[12162,"Tonsenhagen skole",415]
[12163,"Toppåsen skole",-377]
[12164,"Trasop skole",3079]
[12165,"Trosterud skole",68]
[12166,"Tveita skole",-19]
[12167,"Tøyen skole",-1907]
[12168,"Tåsen skole",1073]
[12169,"Ullevål skole",176]
[12170,"Vahl skole",45]
[12171,"Vestli skole",391]
[12172,"Vinderen skole",776]
[12173,"Voksen skole",585]
[12174,"Vålerenga skole",813]
[12175,"Østensjø skole",-502]
[12176,"Bogstad skole",846]
[12177,"Løren skole",-823]
[12178,"Berg skole",839]
[12179,"Fernanda Nissen skole",1580]
[12180,"Brynseng skole",-107]
[12200,"Abildsø skole",586]
[12201,"Bjølsen skole",-49]
[12202,"Bjøråsen skole",1290]
[12203,"Bøler skole",566]
[12204,"Gran skole",-1133]
[12205,"Haugen skole",-3779]
[12206,"Høyenhall skole",1796]
[12207,"Ila skole",519]
[12208,"Karlsrud skole",875]
[12209,"Lambertseter skole",-3]
[12210,"Lindeberg skole",285]
[12211,"Linderud skole",-3586]
[12212,"Majorstuen skole",-1568]
[12213,"Marienlyst skole",-1901]
[12214,"Oppsal skole",-1701]
[12215,"Rommen skole",-379]
[12216,"Ruseløkka skole",-508]
[12217,"Sinsen skole",699]
[12218,"Uranienborg skole",188]
[12219,"Veitvet skole",-5088]
[12220,"Årvoll skole",103]
[12221,"Markaskolen",-294]
[12222,"Nordisk skoleidrett",62]
[12223,"Språksenteret",1306]
[12224,"Oslo sjøskole (Hovedøya)",193]
[12225,"Skolehagene",219]
[12226,"Kastellet skole",-640]
[12227,"Nordpolen skole",-309]
[12228,"Teglverket skole",2964]
[12300,"Apalløkka skole",352]
[12301,"Bjørnholt skole",179]
[12302,"Bjørnsletta skole",1195]
[12303,"Brannfjell skole",-574]
[12304,"Ellingsrud skole",620]
[12305,"Engebråten skole",2125]
[12306,"Groruddalen skole",1458]
[12307,"Haugenstua skole",410]
[12308,"Haugerud skole",135]
[12309,"Hauketo skole",1746]
[12311,"Holmlia skole",701]
[12313,"Hovseter skole",101]
[12314,"Jordal skole",1981]
{"$rows_left_out":279}
{"sheet":"Rapport","index":3,"n_rows":275,"n_cols":11,"rows_kept":275,"cut":false,"hidden":false,"merged":[[11,1,11,7],[0,0,0,9],[7,2,7,5],[17,1,21,8],[15,1,15,7],[13,1,13,7],[274,2,274,7],[30,1,33,8],[37,1,40,8],[24,1,24,8],[25,1,25,8],[26,1,26,8],[43,1,44,8]]}
["Årsregnskapsrapport 2016"]
[null,"Rapporten skal behandles i driftsstyret med følgende vedlegg:"]
[]
[null,"1) Fullstendighetserklæring"]
[null,"2) Utfylt mal for budsjettjustering av mer-/mindreforbruk"]
[null,"3) Driftsrapport UDE140 per 31.12"]
[]
[null,"Skole:",{"$f":"IF(C9<>\"\",VLOOKUP(C9,inkl,2,FALSE),\"\")","v":"Skøyen skole"}]
[null,"Koststed:",12152]
[]
[]
[null,"Regnskapsresultat for koststedet inkl. prosjekter (hele tusen):",null,null,null,null,null,null,{"$f":"IF($C$9<>\"\",VLOOKUP($C$9,'res inkl prosjekter'!$A$2:$C$1437,3,FALSE),\"\")","v":1235}]
[]
[null,"Skolen meldte per 2. tertial om prognoseavvik per 31.12 (hele tusen):",null,null,null,null,null,null,{"$f":"IF(ISERROR(VLOOKUP($C$9,Prognose!$A$2:$C$1501,3,FALSE)),\"Ikke registrert prognose\",IF($C$9<>\"\",VLOOKUP($C$9,Prognose!$A$2:$C$1501,3,FALSE)/1000,\"\"))","v":0}]
[]
[null,"Avvik regnskapsresultat - prognoseavik:",null,null,null,null,null,null,{"$f":"IF(ISNUMBER(I12-I14),I12-I14,\"\")","v":1235}]
[null,"Hva skyldes avviket mellom regnskapsresultat og prognoseavvik?"]
[null,"Vi har fått større tildelinger og flere elever enn beregnet i år. I tillegg ble det forsinkelser i valg av leverandør til elev-pcer slik at en del av disse ikke er med i 2016-budsjettet."]
[]
[]
[]
[]
[]
[]
[]
[]
[]
[]
[null,"Merforbruk ekskl. øremerkede prosjekter",null,null,null,null,null,null,{"$f":"IF($K$29<=-1,K29,\"\")","v":""},null,{"$f":"IF($C$9<>\"\",VLOOKUP($C$9,'res eksl prosjekter'!$A$2:$C$1433,3,FALSE),\"\")","v":1080}]
[null,"Tiltak som er iverksatt for å innarbeide merforbruket i 2016;"]
[]
[]
[]
[]
[]
[null,"Mindreforbruk ekskl. øremerkede prosjekter",null,null,null,null,null,null,{"$f":"IF($K$29>-1,$K$29,\"\")","v":1080}]
[null,"Mindreforbruket foreslås disponert til følgende:"]
[null,"Lønn ped. personale"]
[]
[]
[]
[]
[]
[null,"Årsregnskapsrapporten, fullstendighetserklæring og budsjettjusteringsfil sendes inn via rapporteringsportalen til Avdeling for økonomi."]
[]
[]
[]
[]
[]
[]
[]
[]
[]
[]
[]
[]
[]
[]
[]
[]
[]
[]
[]
[]
[]
[]
[]
[]
[]
[]
[]
[]
[]
[]
[]
[]
[]
[]
[]
[]
[]
[]
[]
[]
[]
[]
[]
[]
[]
[]
[]
[]
[]
[]
[]
[]
[]
[]
[]
[]
[]
[]
[]
[]
[]
[]
[]
[]
[]
[]
[]
[]
[]
[]
[]
[]
[]
[]
[]
[]
[]
[]
[]
[]
[]
[]
[]
[]
[]
[]
[]
[]
[]
[]
[]
[]
[]
[]
[]
[]
[]
[]
[]
[]
[]
[]
[]
[]
[]
[]
[]
[]
[]
[]
[]
[]
[]
[]
[]
[]
[]
[]
[]
[]
[]
[]
[]
[]
[]
[]
[]
[]
[]
[]
[]
[]
[]
[]
[]
[]
[]
[]
[]
[]
[]
[]
[]
[]
[]
[]
[]
[]
[]
[]
[]
[]
[]
[]
[]
[]
{"$rows_left_out":75}